[sugar] sugar-jhbuild buildone dbus

Ben Juhn benjuhn
Sun Mar 11 12:13:35 EDT 2007


I'm having problems building dbus all of a sudden.

dbus-sysdeps-util-unix.c: In function '_dbus_become_daemon':
dbus-sysdeps-util-unix.c:138: error: invalid operands to binary >=
make[3]: *** [dbus-sysdeps-util-unix.lo] Error 1
make[3]: Leaving directory `/home/ben/sugar-jhbuild/source/dbus/dbus'
make[2]: *** [all] Error 2
make[2]: Leaving directory `/home/ben/sugar-jhbuild/source/dbus/dbus'
make[1]: *** [all-recursive] Error 1
make[1]: Leaving directory `/home/ben/sugar-jhbuild/source/dbus'
make: *** [all] Error 2
*** error during stage build of dbus: ########## Error running make   *** [1/1]

Trying to figure out if the error may be due to something I've changed since my
last build of dbus(as it worked before) or if the version on the repository is
bugged.  Has anyone else encountered this error?


More information about the Sugar-devel mailing list